ASF 3.25.0 kills builds?

1 post / 0 new
Author
Message
#1
  • 1
  • 2
  • 3
  • 4
  • 5
Total votes: 0

I updated to ASF 3.25.0 and now nothing builds, not even the ASF examples. The target is the SAM3U4E (the SAM3U-EK). Has anyone else seen this? The failure is here:

 

Invoking: ARM/GNU C Compiler : 4.8.4
"C:\Program Files (x86)\Atmel\Atmel Toolchain\ARM GCC\Native\4.8.1443\arm-gnu-toolchain\bin\arm-none-eabi-gcc.exe"  -x c -mthumb -D__SAM3U4E__ -DDEBUG -D__SAM3U4E__ -DBOARD=SAM3U_EK -Dscanf=iscanf -DARM_MATH_CM3=true -Dprintf=iprintf  -I"../sam/utils/cmsis/cm3_cmsis_example/sam3u4e_sam3u_ek" -I"../src/ASF/sam/utils/cmsis/sam3u/include" -I"../src/ASF/thirdparty/CMSIS/Lib/GCC" -I"../src/config" -I"../src/ASF/common/utils" -I"../src" -I"../src/ASF/sam/utils/cmsis/sam3u/source/templates" -I"../src/ASF/common/services/clock" -I"../src/ASF/sam/drivers/pmc" -I"../src/ASF/common/services/gpio" -I"../src/ASF/sam/boards" -I"../src/ASF/sam/utils" -I"../src/ASF/sam/utils/preprocessor" -I"../src/ASF/common/boards" -I"../src/ASF/sam/drivers/pio" -I"../src/ASF/sam/utils/header_files" -I"../src/ASF/common/services/ioport" -I"../src/ASF/sam/boards/sam3u_ek" -I"../src/ASF/thirdparty/CMSIS/Include"  -O1 -fdata-sections -ffunction-sections -mlong-calls -g3 -Wall -mcpu=cortex-m3 -c -pipe -fno-strict-aliasing -Wall -Wstrict-prototypes -Wmissing-prototypes -Werror-implicit-function-declaration -Wpointer-arith -std=gnu99 -ffunction-sections -fdata-sections -Wchar-subscripts -Wcomment -Wformat=2 -Wimplicit-int -Wmain -Wparentheses -Wsequence-point -Wreturn-type -Wswitch -Wtrigraphs -Wunused -Wuninitialized -Wunknown-pragmas -Wfloat-equal -Wundef -Wshadow -Wbad-function-cast -Wwrite-strings -Wsign-compare -Waggregate-return  -Wmissing-declarations -Wformat -Wmissing-format-attribute -Wno-deprecated-declarations -Wpacked -Wredundant-decls -Wnested-externs -Wlong-long -Wunreachable-code -Wcast-align --param max-inline-insns-single=500 -MD -MP -MF "cmsis/src/system_sam3u.d" -MT"cmsis/src/system_sam3u.d" -MT"cmsis/src/system_sam3u.o"   -o "cmsis/src/system_sam3u.o" "../cmsis/src/system_sam3u.c" 
        ../cmsis/src/system_sam3u.c: In function 'SystemInit':
P:\usbaudio\CMSIS_CM3_CMSIS_EXAMPLE1\cmsis\src\system_sam3u.c(63,19): error: 'CKGR_MOR_KEY_PASSWD' undeclared (first use in this function)
           PMC->CKGR_MOR = CKGR_MOR_KEY_PASSWD | SYS_BOARD_OSCOUNT | CKGR_MOR_MOSCRCEN | CKGR_MOR_MOSCXTEN;
                           ^
P:\usbaudio\CMSIS_CM3_CMSIS_EXAMPLE1\cmsis\src\system_sam3u.c(63,19): info: each undeclared identifier is reported only once for each function it appears in
        ../cmsis/src/system_sam3u.c: In function 'SystemCoreClockUpdate':
P:\usbaudio\CMSIS_CM3_CMSIS_EXAMPLE1\cmsis\src\system_sam3u.c(178,27): error: 'CHIP_FREQ_UTMIPLL' undeclared (first use in this function)
                 SystemCoreClock = CHIP_FREQ_UTMIPLL / 2U;
                                   ^
        make: *** [cmsis/src/system_sam3u.o] Error 1
    Done executing task "RunCompilerTask" -- FAILED.

 

 

 

×