avr gcc building solution issue

Go To Last Post
3 posts / 0 new
Author
Message
#1
  • 1
  • 2
  • 3
  • 4
  • 5
Total votes: 0

Hi
here is the problem
when i first build a solution everything works well but after that when i do some changes in the code the compiler stops to work completely
and i get this when ever i build the solution

Quote:

------ Build started: Project: GccApplication1, Configuration: Debug AVR ------
Build started.
Project "GccApplication1.cproj" (default targets):
Target "PreBuildEvent" skipped, due to false condition; ('$(PreBuildEvent)'!='') was evaluated as (''!='').
Target "CoreBuild" in file "C:\Program Files (x86)\Atmel\Atmel Studio 6.0\Vs\Compiler.targets" from project "C:\AVR\AVR GCC tutorial\clock\2\GccApplication1\GccApplication1\GccApplication1.cproj" (target "Build" depends on it):
Task "RunCompilerTask"
C:\Program Files (x86)\Atmel\Atmel Studio 6.0\make\make.exe all
Done executing task "RunCompilerTask" -- FAILED.
Done building target "CoreBuild" in project "GccApplication1.cproj" -- FAILED.
Done building project "GccApplication1.cproj" -- FAILED.

Build FAILED.
========== Build: 0 succeeded or up-to-date, 1 failed, 0 skipped ==========

I don't need a Handkerchief; i have no more tear to shed anymore - Solid Snake

  • 1
  • 2
  • 3
  • 4
  • 5
Total votes: 0

Does that happen even if you use "rebuild" rather than "build"?

  • 1
  • 2
  • 3
  • 4
  • 5
Total votes: 0

Quote:
Does that happen even if you use "rebuild" rather than "build"?

yeah i get this
Quote:

------ Rebuild All started: Project: GccApplication1, Configuration: Debug AVR ------
Build started.
Project "GccApplication1.cproj" (ReBuild target(s)):
Target "PreBuildEvent" skipped, due to false condition; ('$(PreBuildEvent)'!='') was evaluated as (''!='').
Target "CoreRebuild" in file "C:\Program Files (x86)\Atmel\Atmel Studio 6.0\Vs\Compiler.targets" from project "C:\AVR\AVR GCC tutorial\clock\2\GccApplication1\GccApplication1\GccApplication1.cproj" (target "ReBuild" depends on it):
Task "RunCompilerTask"
C:\Program Files (x86)\Atmel\Atmel Studio 6.0\make\make.exe clean all
rm -rf GccApplication1.o lcd_lib.o rprintf.o timer.o GccApplication1.d lcd_lib.d rprintf.d timer.d
rm -rf "GccApplication1.elf" "GccApplication1.a" "GccApplication1.hex" "GccApplication1.lss" "GccApplication1.eep" "GccApplication1.map"
Done executing task "RunCompilerTask" -- FAILED.
Done building target "CoreRebuild" in project "GccApplication1.cproj" -- FAILED.
Done building project "GccApplication1.cproj" -- FAILED.

Build FAILED.
========== Rebuild All: 0 succeeded, 1 failed, 0 skipped ==========

I don't need a Handkerchief; i have no more tear to shed anymore - Solid Snake