All Examples on SAME70 XPlained board fail to compile

Go To Last Post
3 posts / 0 new
Author
Message
#1
  • 1
  • 2
  • 3
  • 4
  • 5
Total votes: 0

Hey guys, I just got a new board and none of the official examples compile. I am using the latest AS7 and the entire toolchain is updated to the latest firmware. Finally, excited to move on from Arduino toys and get the ball rolling on SAME70 xplained board. It is feature packed! Nothing kills the excitement than opening up the box, drooling all over and finally sticking the USB cable in, booting up a PWM LED example...and you get an OFFICIAL example fail to compile right from the get go.

Your help is truly appreciated :)

Here is the error I am getting:

------ Build started: Project: CHIPID_EXAMPLE1, Configuration: Debug ARM ------
Build started.
Project "CHIPID_EXAMPLE1.cproj" (default targets):
Target "PreBuildEvent" skipped, due to false condition; ('$(PreBuildEvent)'!='') was evaluated as (''!='').
Target "CoreBuild" in file "C:\Program Files (x86)\Atmel\Studio\7.0\Vs\Compiler.targets" from project "C:\Users\Jack\Documents\Atmel Studio\7.0\CHIPID_EXAMPLE1\CHIPID_EXAMPLE1\CHIPID_EXAMPLE1.cproj" (target "Build" depends on it):
	Using "RunCompilerTask" task from assembly "C:\Program Files (x86)\Atmel\Studio\7.0\Extensions\Application\AvrGCC.dll".
	Task "RunCompilerTask"
		Shell Utils Path C:\Program Files (x86)\Atmel\Studio\7.0\shellUtils
		C:\Program Files (x86)\Atmel\Studio\7.0\shellUtils\make.exe all --jobs 20 --output-sync
		Building file: ../src/ASF/common/services/clock/same70/sysclk.c
		Invoking: ARM/GNU C Compiler : 0.0.0
		process_begin: CreateProcess(NULL, "C:\Program Files (x86)\Atmel\Studio\7.0\toolchain\arm\arm-gnu-toolchain\bin\arm-none-eabi-gcc.exe" -x c -mthumb -D__SAME70Q21__ -DDEBUG -D__SAME70Q21__ -DBOARD=SAME70_XPLAINED -Dscanf=iscanf -DARM_MATH_CM7=true -Dprintf=iprintf -I../src/ASF/sam/drivers/chipid -I../src/ASF/sam/utils -I../src/ASF/sam/utils/header_files -I../src/ASF/sam/utils/preprocessor -I../src/ASF/thirdparty/CMSIS/Include -I../src/ASF/thirdparty/CMSIS/Lib/GCC -I../src/ASF/sam/utils/fpu -I../src/ASF/common/utils -I../src/ASF/sam/utils/cmsis/same70/include -I../src/ASF/sam/utils/cmsis/same70/source/templates -I../src/ASF/common/services/clock -I../src/ASF/sam/drivers/pmc -I../src/ASF/common/utils/stdio/stdio_serial -I../src/ASF/common/services/serial/sam_uart -I../src/ASF/common/services/serial -I../src/ASF/sam/drivers/uart -I../src/ASF/sam/drivers/usart -I../src/ASF/sam/boards/same70_xplained -I../src/ASF/sam/boards -I../src/ASF/common/boards -I../src/ASF/common/services/ioport -I../src/ASF/common/services/gpio -I../src/ASF/sam/drivers/pio -I../src/ASF/sam/drivers/mpu -I../src -I../src/config -O1 -fdata-sections -ffunction-sections -mlong-calls -g3 -Wall -mcpu=cortex-m7 -c -pipe -fno-strict-aliasing -Wall -Wstrict-prototypes -Wmissing-prototypes -Werror-implicit-function-declaration -Wpointer-arith -std=gnu99 -ffunction-sections -fdata-sections -Wchar-subscripts -Wcomment -Wformat=2 -Wimplicit-int -Wmain -Wparentheses -Wsequence-point -Wreturn-type -Wswitch -Wtrigraphs -Wunused -Wuninitialized -Wunknown-pragmas -Wfloat-equal -Wundef -Wshadow -Wbad-function-cast -Wwrite-strings -Wsign-compare -Waggregate-return -Wmissing-declarations -Wformat -Wmissing-format-attribute -Wno-deprecated-declarations -Wpacked -Wredundant-decls -Wnested-externs -Wlong-long -Wunreachable-code -Wcast-align --param max-inline-insns-single=500 -mfloat-abi=softfp -mfpu=fpv5-sp-d16 -MD -MP -MF src/ASF/common/services/clock/same70/sysclk.d -MTsrc/ASF/common/services/clock/same70/sysclk.d -MTsrc/ASF/common/services/clock/same70/sysclk.o -o src/ASF/common/services/clock/same70/sysclk.o ../src/ASF/common/services/clock/same70/sysclk.c, ...) failed.
		make (e=2): The system cannot find the file specified.
		make: *** [src/ASF/common/services/clock/same70/sysclk.o] Error 2
		"C:\Program Files (x86)\Atmel\Studio\7.0\toolchain\arm\arm-gnu-toolchain\bin\arm-none-eabi-gcc.exe"  -x c -mthumb -D__SAME70Q21__ -DDEBUG -D__SAME70Q21__ -DBOARD=SAME70_XPLAINED -Dscanf=iscanf -DARM_MATH_CM7=true -Dprintf=iprintf  -I"../src/ASF/sam/drivers/chipid" -I"../src/ASF/sam/utils" -I"../src/ASF/sam/utils/header_files" -I"../src/ASF/sam/utils/preprocessor" -I"../src/ASF/thirdparty/CMSIS/Include" -I"../src/ASF/thirdparty/CMSIS/Lib/GCC" -I"../src/ASF/sam/utils/fpu" -I"../src/ASF/common/utils" -I"../src/ASF/sam/utils/cmsis/same70/include" -I"../src/ASF/sam/utils/cmsis/same70/source/templates" -I"../src/ASF/common/services/clock" -I"../src/ASF/sam/drivers/pmc" -I"../src/ASF/common/utils/stdio/stdio_serial" -I"../src/ASF/common/services/serial/sam_uart" -I"../src/ASF/common/services/serial" -I"../src/ASF/sam/drivers/uart" -I"../src/ASF/sam/drivers/usart" -I"../src/ASF/sam/boards/same70_xplained" -I"../src/ASF/sam/boards" -I"../src/ASF/common/boards" -I"../src/ASF/common/services/ioport" -I"../src/ASF/common/services/gpio" -I"../src/ASF/sam/drivers/pio" -I"../src/ASF/sam/drivers/mpu" -I"../src" -I"../src/config"  -O1 -fdata-sections -ffunction-sections -mlong-calls -g3 -Wall -mcpu=cortex-m7 -c -pipe -fno-strict-aliasing -Wall -Wstrict-prototypes -Wmissing-prototypes -Werror-implicit-function-declaration -Wpointer-arith -std=gnu99 -ffunction-sections -fdata-sections -Wchar-subscripts -Wcomment -Wformat=2 -Wimplicit-int -Wmain -Wparentheses -Wsequence-point -Wreturn-type -Wswitch -Wtrigraphs -Wunused -Wuninitialized -Wunknown-pragmas -Wfloat-equal -Wundef -Wshadow -Wbad-function-cast -Wwrite-strings -Wsign-compare -Waggregate-return -Wmissing-declarations -Wformat -Wmissing-format-attribute -Wno-deprecated-declarations -Wpacked -Wredundant-decls -Wnested-externs -Wlong-long -Wunreachable-code -Wcast-align --param max-inline-insns-single=500 -mfloat-abi=softfp -mfpu=fpv5-sp-d16 -MD -MP -MF "src/ASF/common/services/clock/same70/sysclk.d" -MT"src/ASF/common/services/clock/same70/sysclk.d" -MT"src/ASF/common/services/clock/same70/sysclk.o"   -o "src/ASF/common/services/clock/same70/sysclk.o" "../src/ASF/common/services/clock/same70/sysclk.c"
C:\Users\Jack\Documents\Atmel Studio\7.0\CHIPID_EXAMPLE1\CHIPID_EXAMPLE1\Debug\Makefile(252,1): error: recipe for target 'src/ASF/common/services/clock/same70/sysclk.o' failed
		make: *** Waiting for unfinished jobs....
		Building file: ../src/ASF/common/services/serial/usart_serial.c
		Invoking: ARM/GNU C Compiler : 0.0.0
		"C:\Program Files (x86)\Atmel\Studio\7.0\toolchain\arm\arm-gnu-toolchain\bin\arm-none-eabi-gcc.exe"  -x c -mthumb -D__SAME70Q21__ -DDEBUG -D__SAME70Q21__ -DBOARD=SAME70_XPLAINED -Dscanf=iscanf -DARM_MATH_CM7=true -Dprintf=iprintf  -I"../src/ASF/sam/drivers/chipid" -I"../src/ASF/sam/utils" -I"../src/ASF/sam/utils/header_files" -I"../src/ASF/sam/utils/preprocessor" -I"../src/ASF/thirdparty/CMSIS/Include" -I"../src/ASF/thirdparty/CMSIS/Lib/GCC" -I"../src/ASF/sam/utils/fpu" -I"../src/ASF/common/utils" -I"../src/ASF/sam/utils/cmsis/same70/include" -I"../src/ASF/sam/utils/cmsis/same70/source/templates" -I"../src/ASF/common/services/clock" -I"../src/ASF/sam/drivers/pmc" -I"../src/ASF/common/utils/stdio/stdio_serial" -I"../src/ASF/common/services/serial/sam_uart" -I"../src/ASF/common/services/serial" -I"../src/ASF/sam/drivers/uart" -I"../src/ASF/sam/drivers/usart" -I"../src/ASF/sam/boards/same70_xplained" -I"../src/ASF/sam/boards" -I"../src/ASF/common/boards" -I"../src/ASF/common/services/ioport" -I"../src/ASF/common/services/gpio" -I"../src/ASF/sam/drivers/pio" -I"../src/ASF/sam/drivers/mpu" -I"../src" -I"../src/config"  -O1 -fdata-sections -ffunction-sections -mlong-calls -g3 -Wall -mcpu=cortex-m7 -c -pipe -fno-strict-aliasing -Wall -Wstrict-prototypes -Wmissing-prototypes -Werror-implicit-function-declaration -Wpointer-arith -std=gnu99 -ffunction-sections -fdata-sections -Wchar-subscripts -Wcomment -Wformat=2 -Wimplicit-int -Wmain -Wparentheses -Wsequence-point -Wreturn-type -Wswitch -Wtrigraphs -Wunused -Wuninitialized -Wunknown-pragmas -Wfloat-equal -Wundef -Wshadow -Wbad-function-cast -Wwrite-strings -Wsign-compare -Waggregate-return -Wmissing-declarations -Wformat -Wmissing-format-attribute -Wno-deprecated-declarations -Wpacked -Wredundant-decls -Wnested-externs -Wlong-long -Wunreachable-code -Wcast-align --param max-inline-insns-single=500 -mfloat-abi=softfp -mfpu=fpv5-sp-d16 -MD -MP -MF "src/ASF/common/services/serial/usart_serial.d" -MT"src/ASF/common/services/serial/usart_serial.d" -MT"src/ASF/common/services/serial/usart_serial.o"   -o "src/ASF/common/services/serial/usart_serial.o" "../src/ASF/common/services/serial/usart_serial.c"
C:\Users\Jack\Documents\Atmel Studio\7.0\CHIPID_EXAMPLE1\CHIPID_EXAMPLE1\Debug\Makefile(259,1): error: recipe for target 'src/ASF/common/services/serial/usart_serial.o' failed
		process_begin: CreateProcess(NULL, "C:\Program Files (x86)\Atmel\Studio\7.0\toolchain\arm\arm-gnu-toolchain\bin\arm-none-eabi-gcc.exe" -x c -mthumb -D__SAME70Q21__ -DDEBUG -D__SAME70Q21__ -DBOARD=SAME70_XPLAINED -Dscanf=iscanf -DARM_MATH_CM7=true -Dprintf=iprintf -I../src/ASF/sam/drivers/chipid -I../src/ASF/sam/utils -I../src/ASF/sam/utils/header_files -I../src/ASF/sam/utils/preprocessor -I../src/ASF/thirdparty/CMSIS/Include -I../src/ASF/thirdparty/CMSIS/Lib/GCC -I../src/ASF/sam/utils/fpu -I../src/ASF/common/utils -I../src/ASF/sam/utils/cmsis/same70/include -I../src/ASF/sam/utils/cmsis/same70/source/templates -I../src/ASF/common/services/clock -I../src/ASF/sam/drivers/pmc -I../src/ASF/common/utils/stdio/stdio_serial -I../src/ASF/common/services/serial/sam_uart -I../src/ASF/common/services/serial -I../src/ASF/sam/drivers/uart -I../src/ASF/sam/drivers/usart -I../src/ASF/sam/boards/same70_xplained -I../src/ASF/sam/boards -I../src/ASF/common/boards -I../src/ASF/common/services/ioport -I../src/ASF/common/services/gpio -I../src/ASF/sam/drivers/pio -I../src/ASF/sam/drivers/mpu -I../src -I../src/config -O1 -fdata-sections -ffunction-sections -mlong-calls -g3 -Wall -mcpu=cortex-m7 -c -pipe -fno-strict-aliasing -Wall -Wstrict-prototypes -Wmissing-prototypes -Werror-implicit-function-declaration -Wpointer-arith -std=gnu99 -ffunction-sections -fdata-sections -Wchar-subscripts -Wcomment -Wformat=2 -Wimplicit-int -Wmain -Wparentheses -Wsequence-point -Wreturn-type -Wswitch -Wtrigraphs -Wunused -Wuninitialized -Wunknown-pragmas -Wfloat-equal -Wundef -Wshadow -Wbad-function-cast -Wwrite-strings -Wsign-compare -Waggregate-return -Wmissing-declarations -Wformat -Wmissing-format-attribute -Wno-deprecated-declarations -Wpacked -Wredundant-decls -Wnested-externs -Wlong-long -Wunreachable-code -Wcast-align --param max-inline-insns-single=500 -mfloat-abi=softfp -mfpu=fpv5-sp-d16 -MD -MP -MF src/ASF/common/services/serial/usart_serial.d -MTsrc/ASF/common/services/serial/usart_serial.d -MTsrc/ASF/common/services/serial/usart_serial.o -o src/ASF/common/services/serial/usart_serial.o ../src/ASF/common/services/serial/usart_serial.c, ...) failed.
		make (e=2): The system cannot find the file specified.
		make: *** [src/ASF/common/services/serial/usart_serial.o] Error 2
		Building file: ../src/ASF/common/utils/interrupt/interrupt_sam_nvic.c
		Invoking: ARM/GNU C Compiler : 0.0.0
		"C:\Program Files (x86)\Atmel\Studio\7.0\toolchain\arm\arm-gnu-toolchain\bin\arm-none-eabi-gcc.exe"  -x c -mthumb -D__SAME70Q21__ -DDEBUG -D__SAME70Q21__ -DBOARD=SAME70_XPLAINED -Dscanf=iscanf -DARM_MATH_CM7=true -Dprintf=iprintf  -I"../src/ASF/sam/drivers/chipid" -I"../src/ASF/sam/utils" -I"../src/ASF/sam/utils/header_files" -I"../src/ASF/sam/utils/preprocessor" -I"../src/ASF/thirdparty/CMSIS/Include" -I"../src/ASF/thirdparty/CMSIS/Lib/GCC" -I"../src/ASF/sam/utils/fpu" -I"../src/ASF/common/utils" -I"../src/ASF/sam/utils/cmsis/same70/include" -I"../src/ASF/sam/utils/cmsis/same70/source/templates" -I"../src/ASF/common/services/clock" -I"../src/ASF/sam/drivers/pmc" -I"../src/ASF/common/utils/stdio/stdio_serial" -I"../src/ASF/common/services/serial/sam_uart" -I"../src/ASF/common/services/serial" -I"../src/ASF/sam/drivers/uart" -I"../src/ASF/sam/drivers/usart" -I"../src/ASF/sam/boards/same70_xplained" -I"../src/ASF/sam/boards" -I"../src/ASF/common/boards" -I"../src/ASF/common/services/ioport" -I"../src/ASF/common/services/gpio" -I"../src/ASF/sam/drivers/pio" -I"../src/ASF/sam/drivers/mpu" -I"../src" -I"../src/config"  -O1 -fdata-sections -ffunction-sections -mlong-calls -g3 -Wall -mcpu=cortex-m7 -c -pipe -fno-strict-aliasing -Wall -Wstrict-prototypes -Wmissing-prototypes -Werror-implicit-function-declaration -Wpointer-arith -std=gnu99 -ffunction-sections -fdata-sections -Wchar-subscripts -Wcomment -Wformat=2 -Wimplicit-int -Wmain -Wparentheses -Wsequence-point -Wreturn-type -Wswitch -Wtrigraphs -Wunused -Wuninitialized -Wunknown-pragmas -Wfloat-equal -Wundef -Wshadow -Wbad-function-cast -Wwrite-strings -Wsign-compare -Waggregate-return -Wmissing-declarations -Wformat -Wmissing-format-attribute -Wno-deprecated-declarations -Wpacked -Wredundant-decls -Wnested-externs -Wlong-long -Wunreachable-code -Wcast-align --param max-inline-insns-single=500 -mfloat-abi=softfp -mfpu=fpv5-sp-d16 -MD -MP -MF "src/ASF/common/utils/interrupt/interrupt_sam_nvic.d" -MT"src/ASF/common/utils/interrupt/interrupt_sam_nvic.d" -MT"src/ASF/common/utils/interrupt/interrupt_sam_nvic.o"   -o "src/ASF/common/utils/interrupt/interrupt_sam_nvic.o" "../src/ASF/common/utils/interrupt/interrupt_sam_nvic.c"
C:\Users\Jack\Documents\Atmel Studio\7.0\CHIPID_EXAMPLE1\CHIPID_EXAMPLE1\Debug\Makefile(266,1): error: recipe for target 'src/ASF/common/utils/interrupt/interrupt_sam_nvic.o' failed
		process_begin: CreateProcess(NULL, "C:\Program Files (x86)\Atmel\Studio\7.0\toolchain\arm\arm-gnu-toolchain\bin\arm-none-eabi-gcc.exe" -x c -mthumb -D__SAME70Q21__ -DDEBUG -D__SAME70Q21__ -DBOARD=SAME70_XPLAINED -Dscanf=iscanf -DARM_MATH_CM7=true -Dprintf=iprintf -I../src/ASF/sam/drivers/chipid -I../src/ASF/sam/utils -I../src/ASF/sam/utils/header_files -I../src/ASF/sam/utils/preprocessor -I../src/ASF/thirdparty/CMSIS/Include -I../src/ASF/thirdparty/CMSIS/Lib/GCC -I../src/ASF/sam/utils/fpu -I../src/ASF/common/utils -I../src/ASF/sam/utils/cmsis/same70/include -I../src/ASF/sam/utils/cmsis/same70/source/templates -I../src/ASF/common/services/clock -I../src/ASF/sam/drivers/pmc -I../src/ASF/common/utils/stdio/stdio_serial -I../src/ASF/common/services/serial/sam_uart -I../src/ASF/common/services/serial -I../src/ASF/sam/drivers/uart -I../src/ASF/sam/drivers/usart -I../src/ASF/sam/boards/same70_xplained -I../src/ASF/sam/boards -I../src/ASF/common/boards -I../src/ASF/common/services/ioport -I../src/ASF/common/services/gpio -I../src/ASF/sam/drivers/pio -I../src/ASF/sam/drivers/mpu -I../src -I../src/config -O1 -fdata-sections -ffunction-sections -mlong-calls -g3 -Wall -mcpu=cortex-m7 -c -pipe -fno-strict-aliasing -Wall -Wstrict-prototypes -Wmissing-prototypes -Werror-implicit-function-declaration -Wpointer-arith -std=gnu99 -ffunction-sections -fdata-sections -Wchar-subscripts -Wcomment -Wformat=2 -Wimplicit-int -Wmain -Wparentheses -Wsequence-point -Wreturn-type -Wswitch -Wtrigraphs -Wunused -Wuninitialized -Wunknown-pragmas -Wfloat-equal -Wundef -Wshadow -Wbad-function-cast -Wwrite-strings -Wsign-compare -Waggregate-return -Wmissing-declarations -Wformat -Wmissing-format-attribute -Wno-deprecated-declarations -Wpacked -Wredundant-decls -Wnested-externs -Wlong-long -Wunreachable-code -Wcast-align --param max-inline-insns-single=500 -mfloat-abi=softfp -mfpu=fpv5-sp-d16 -MD -MP -MF src/ASF/common/utils/interrupt/interrupt_sam_nvic.d -MTsrc/ASF/common/utils/interrupt/interrupt_sam_nvic.d -MTsrc/ASF/common/utils/interrupt/interrupt_sam_nvic.o -o src/ASF/common/utils/interrupt/interrupt_sam_nvic.o ../src/ASF/common/utils/interrupt/interrupt_sam_nvic.c, ...) failed.
		make (e=2): The system cannot find the file specified.
		make: *** [src/ASF/common/utils/interrupt/interrupt_sam_nvic.o] Error 2
		Building file: ../src/ASF/common/utils/stdio/read.c
		Invoking: ARM/GNU C Compiler : 0.0.0
		"C:\Program Files (x86)\Atmel\Studio\7.0\toolchain\arm\arm-gnu-toolchain\bin\arm-none-eabi-gcc.exe"  -x c -mthumb -D__SAME70Q21__ -DDEBUG -D__SAME70Q21__ -DBOARD=SAME70_XPLAINED -Dscanf=iscanf -DARM_MATH_CM7=true -Dprintf=iprintf  -I"../src/ASF/sam/drivers/chipid" -I"../src/ASF/sam/utils" -I"../src/ASF/sam/utils/header_files" -I"../src/ASF/sam/utils/preprocessor" -I"../src/ASF/thirdparty/CMSIS/Include" -I"../src/ASF/thirdparty/CMSIS/Lib/GCC" -I"../src/ASF/sam/utils/fpu" -I"../src/ASF/common/utils" -I"../src/ASF/sam/utils/cmsis/same70/include" -I"../src/ASF/sam/utils/cmsis/same70/source/templates" -I"../src/ASF/common/services/clock" -I"../src/ASF/sam/drivers/pmc" -I"../src/ASF/common/utils/stdio/stdio_serial" -I"../src/ASF/common/services/serial/sam_uart" -I"../src/ASF/common/services/serial" -I"../src/ASF/sam/drivers/uart" -I"../src/ASF/sam/drivers/usart" -I"../src/ASF/sam/boards/same70_xplained" -I"../src/ASF/sam/boards" -I"../src/ASF/common/boards" -I"../src/ASF/common/services/ioport" -I"../src/ASF/common/services/gpio" -I"../src/ASF/sam/drivers/pio" -I"../src/ASF/sam/drivers/mpu" -I"../src" -I"../src/config"  -O1 -fdata-sections -ffunction-sections -mlong-calls -g3 -Wall -mcpu=cortex-m7 -c -pipe -fno-strict-aliasing -Wall -Wstrict-prototypes -Wmissing-prototypes -Werror-implicit-function-declaration -Wpointer-arith -std=gnu99 -ffunction-sections -fdata-sections -Wchar-subscripts -Wcomment -Wformat=2 -Wimplicit-int -Wmain -Wparentheses -Wsequence-point -Wreturn-type -Wswitch -Wtrigraphs -Wunused -Wuninitialized -Wunknown-pragmas -Wfloat-equal -Wundef -Wshadow -Wbad-function-cast -Wwrite-strings -Wsign-compare -Waggregate-return -Wmissing-declarations -Wformat -Wmissing-format-attribute -Wno-deprecated-declarations -Wpacked -Wredundant-decls -Wnested-externs -Wlong-long -Wunreachable-code -Wcast-align --param max-inline-insns-single=500 -mfloat-abi=softfp -mfpu=fpv5-sp-d16 -MD -MP -MF "src/ASF/common/utils/stdio/read.d" -MT"src/ASF/common/utils/stdio/read.d" -MT"src/ASF/common/utils/stdio/read.o"   -o "src/ASF/common/utils/stdio/read.o" "../src/ASF/common/utils/stdio/read.c"
C:\Users\Jack\Documents\Atmel Studio\7.0\CHIPID_EXAMPLE1\CHIPID_EXAMPLE1\Debug\Makefile(273,1): error: recipe for target 'src/ASF/common/utils/stdio/read.o' failed
		process_begin: CreateProcess(NULL, "C:\Program Files (x86)\Atmel\Studio\7.0\toolchain\arm\arm-gnu-toolchain\bin\arm-none-eabi-gcc.exe" -x c -mthumb -D__SAME70Q21__ -DDEBUG -D__SAME70Q21__ -DBOARD=SAME70_XPLAINED -Dscanf=iscanf -DARM_MATH_CM7=true -Dprintf=iprintf -I../src/ASF/sam/drivers/chipid -I../src/ASF/sam/utils -I../src/ASF/sam/utils/header_files -I../src/ASF/sam/utils/preprocessor -I../src/ASF/thirdparty/CMSIS/Include -I../src/ASF/thirdparty/CMSIS/Lib/GCC -I../src/ASF/sam/utils/fpu -I../src/ASF/common/utils -I../src/ASF/sam/utils/cmsis/same70/include -I../src/ASF/sam/utils/cmsis/same70/source/templates -I../src/ASF/common/services/clock -I../src/ASF/sam/drivers/pmc -I../src/ASF/common/utils/stdio/stdio_serial -I../src/ASF/common/services/serial/sam_uart -I../src/ASF/common/services/serial -I../src/ASF/sam/drivers/uart -I../src/ASF/sam/drivers/usart -I../src/ASF/sam/boards/same70_xplained -I../src/ASF/sam/boards -I../src/ASF/common/boards -I../src/ASF/common/services/ioport -I../src/ASF/common/services/gpio -I../src/ASF/sam/drivers/pio -I../src/ASF/sam/drivers/mpu -I../src -I../src/config -O1 -fdata-sections -ffunction-sections -mlong-calls -g3 -Wall -mcpu=cortex-m7 -c -pipe -fno-strict-aliasing -Wall -Wstrict-prototypes -Wmissing-prototypes -Werror-implicit-function-declaration -Wpointer-arith -std=gnu99 -ffunction-sections -fdata-sections -Wchar-subscripts -Wcomment -Wformat=2 -Wimplicit-int -Wmain -Wparentheses -Wsequence-point -Wreturn-type -Wswitch -Wtrigraphs -Wunused -Wuninitialized -Wunknown-pragmas -Wfloat-equal -Wundef -Wshadow -Wbad-function-cast -Wwrite-strings -Wsign-compare -Waggregate-return -Wmissing-declarations -Wformat -Wmissing-format-attribute -Wno-deprecated-declarations -Wpacked -Wredundant-decls -Wnested-externs -Wlong-long -Wunreachable-code -Wcast-align --param max-inline-insns-single=500 -mfloat-abi=softfp -mfpu=fpv5-sp-d16 -MD -MP -MF src/ASF/common/utils/stdio/read.d -MTsrc/ASF/common/utils/stdio/read.d -MTsrc/ASF/common/utils/stdio/read.o -o src/ASF/common/utils/stdio/read.o ../src/ASF/common/utils/stdio/read.c, ...) failed.
		make (e=2): The system cannot find the file specified.
		make: *** [src/ASF/common/utils/stdio/read.o] Error 2
		Building file: ../src/ASF/common/utils/stdio/write.c
		Invoking: ARM/GNU C Compiler : 0.0.0
		process_begin: CreateProcess(NULL, "C:\Program Files (x86)\Atmel\Studio\7.0\toolchain\arm\arm-gnu-toolchain\bin\arm-none-eabi-gcc.exe" -x c -mthumb -D__SAME70Q21__ -DDEBUG -D__SAME70Q21__ -DBOARD=SAME70_XPLAINED -Dscanf=iscanf -DARM_MATH_CM7=true -Dprintf=iprintf -I../src/ASF/sam/drivers/chipid -I../src/ASF/sam/utils -I../src/ASF/sam/utils/header_files -I../src/ASF/sam/utils/preprocessor -I../src/ASF/thirdparty/CMSIS/Include -I../src/ASF/thirdparty/CMSIS/Lib/GCC -I../src/ASF/sam/utils/fpu -I../src/ASF/common/utils -I../src/ASF/sam/utils/cmsis/same70/include -I../src/ASF/sam/utils/cmsis/same70/source/templates -I../src/ASF/common/services/clock -I../src/ASF/sam/drivers/pmc -I../src/ASF/common/utils/stdio/stdio_serial -I../src/ASF/common/services/serial/sam_uart -I../src/ASF/common/services/serial -I../src/ASF/sam/drivers/uart -I../src/ASF/sam/drivers/usart -I../src/ASF/sam/boards/same70_xplained -I../src/ASF/sam/boards -I../src/ASF/common/boards -I../src/ASF/common/services/ioport -I../src/ASF/common/services/gpio -I../src/ASF/sam/drivers/pio -I../src/ASF/sam/drivers/mpu -I../src -I../src/config -O1 -fdata-sections -ffunction-sections -mlong-calls -g3 -Wall -mcpu=cortex-m7 -c -pipe -fno-strict-aliasing -Wall -Wstrict-prototypes -Wmissing-prototypes -Werror-implicit-function-declaration -Wpointer-arith -std=gnu99 -ffunction-sections -fdata-sections -Wchar-subscripts -Wcomment -Wformat=2 -Wimplicit-int -Wmain -Wparentheses -Wsequence-point -Wreturn-type -Wswitch -Wtrigraphs -Wunused -Wuninitialized -Wunknown-pragmas -Wfloat-equal -Wundef -Wshadow -Wbad-function-cast -Wwrite-strings -Wsign-compare -Waggregate-return -Wmissing-declarations -Wformat -Wmissing-format-attribute -Wno-deprecated-declarations -Wpacked -Wredundant-decls -Wnested-externs -Wlong-long -Wunreachable-code -Wcast-align --param max-inline-insns-single=500 -mfloat-abi=softfp -mfpu=fpv5-sp-d16 -MD -MP -MF src/ASF/common/utils/stdio/write.d -MTsrc/ASF/common/utils/stdio/write.d -MTsrc/ASF/common/utils/stdio/write.o -o src/ASF/common/utils/stdio/write.o ../src/ASF/common/utils/stdio/write.c, ...) failed.
		make (e=2): The system cannot find the file specified.
		make: *** [src/ASF/common/utils/stdio/write.o] Error 2
		"C:\Program Files (x86)\Atmel\Studio\7.0\toolchain\arm\arm-gnu-toolchain\bin\arm-none-eabi-gcc.exe"  -x c -mthumb -D__SAME70Q21__ -DDEBUG -D__SAME70Q21__ -DBOARD=SAME70_XPLAINED -Dscanf=iscanf -DARM_MATH_CM7=true -Dprintf=iprintf  -I"../src/ASF/sam/drivers/chipid" -I"../src/ASF/sam/utils" -I"../src/ASF/sam/utils/header_files" -I"../src/ASF/sam/utils/preprocessor" -I"../src/ASF/thirdparty/CMSIS/Include" -I"../src/ASF/thirdparty/CMSIS/Lib/GCC" -I"../src/ASF/sam/utils/fpu" -I"../src/ASF/common/utils" -I"../src/ASF/sam/utils/cmsis/same70/include" -I"../src/ASF/sam/utils/cmsis/same70/source/templates" -I"../src/ASF/common/services/clock" -I"../src/ASF/sam/drivers/pmc" -I"../src/ASF/common/utils/stdio/stdio_serial" -I"../src/ASF/common/services/serial/sam_uart" -I"../src/ASF/common/services/serial" -I"../src/ASF/sam/drivers/uart" -I"../src/ASF/sam/drivers/usart" -I"../src/ASF/sam/boards/same70_xplained" -I"../src/ASF/sam/boards" -I"../src/ASF/common/boards" -I"../src/ASF/common/services/ioport" -I"../src/ASF/common/services/gpio" -I"../src/ASF/sam/drivers/pio" -I"../src/ASF/sam/drivers/mpu" -I"../src" -I"../src/config"  -O1 -fdata-sections -ffunction-sections -mlong-calls -g3 -Wall -mcpu=cortex-m7 -c -pipe -fno-strict-aliasing -Wall -Wstrict-prototypes -Wmissing-prototypes -Werror-implicit-function-declaration -Wpointer-arith -std=gnu99 -ffunction-sections -fdata-sections -Wchar-subscripts -Wcomment -Wformat=2 -Wimplicit-int -Wmain -Wparentheses -Wsequence-point -Wreturn-type -Wswitch -Wtrigraphs -Wunused -Wuninitialized -Wunknown-pragmas -Wfloat-equal -Wundef -Wshadow -Wbad-function-cast -Wwrite-strings -Wsign-compare -Waggregate-return -Wmissing-declarations -Wformat -Wmissing-format-attribute -Wno-deprecated-declarations -Wpacked -Wredundant-decls -Wnested-externs -Wlong-long -Wunreachable-code -Wcast-align --param max-inline-insns-single=500 -mfloat-abi=softfp -mfpu=fpv5-sp-d16 -MD -MP -MF "src/ASF/common/utils/stdio/write.d" -MT"src/ASF/common/utils/stdio/write.d" -MT"src/ASF/common/utils/stdio/write.o"   -o "src/ASF/common/utils/stdio/write.o" "../src/ASF/common/utils/stdio/write.c"
C:\Users\Jack\Documents\Atmel Studio\7.0\CHIPID_EXAMPLE1\CHIPID_EXAMPLE1\Debug\Makefile(273,1): error: recipe for target 'src/ASF/common/utils/stdio/write.o' failed
	Done executing task "RunCompilerTask" -- FAILED.
Done building target "CoreBuild" in project "CHIPID_EXAMPLE1.cproj" -- FAILED.
Done building project "CHIPID_EXAMPLE1.cproj" -- FAILED.

Build FAILED.
========== Build: 0 succeeded or up-to-date, 1 failed, 0 skipped ==========

 

Last Edited: Thu. Sep 28, 2017 - 02:48 AM
  • 1
  • 2
  • 3
  • 4
  • 5
Total votes: 0

I am also getting a bunch of these errors when loading an example:

19:34:24: [ERROR] Failed to Retrieve the Version Information for the utilty C:\Program Files (x86)\Atmel\Studio\7.0\toolchain\arm\arm-gnu-toolchain\bin\arm-none-eabi-gcc.exe with arguments --version
19:34:24: [ERROR] Failed to Retrieve the Version Information for the utilty C:\Program Files (x86)\Atmel\Studio\7.0\toolchain\arm\arm-gnu-toolchain\bin\arm-none-eabi-gcc.exe with arguments --version
19:34:24: [WARNING] Include Path not found : C:\Program Files (x86)\Atmel\Studio\7.0\toolchain\arm\arm-gnu-toolchain\arm-none-eabi\include
19:34:24: [WARNING] Include Path not found : include
19:34:24: [WARNING] Include Path not found : include-fixed
19:34:24: [ERROR] Failed to Retrieve the Version Information for the utilty C:\Program Files (x86)\Atmel\Studio\7.0\toolchain\arm\arm-gnu-toolchain\bin\arm-none-eabi-gcc.exe with arguments --version
19:34:24: [ERROR] Failed to Retrieve the Version Information for the utilty C:\Program Files (x86)\Atmel\Studio\7.0\toolchain\arm\arm-gnu-toolchain\bin\arm-none-eabi-gcc.exe with arguments --version
19:34:24: [ERROR] Failed to Retrieve the Version Information for the utilty C:\Program Files (x86)\Atmel\Studio\7.0\toolchain\arm\arm-gnu-toolchain\bin\arm-none-eabi-gcc.exe with arguments --version
19:34:24: [WARNING] Include Path not found : C:\Program Files (x86)\Atmel\Studio\7.0\toolchain\arm\arm-gnu-toolchain\arm-none-eabi\include

 

  • 1
  • 2
  • 3
  • 4
  • 5
Total votes: 0

Path problems due to toolchain update ?

SAME newbie